Reaction Details
TargetG-protein coupled receptor 35
LigandBDBM61632
Substrate/Competitorn/a
Meas. Tech.ChEMBL_983063 (CHEMBL2427423)
IC50 10400±n/a nM
Citation Thimm, DFunke, MMeyer, AMüller, CE 6-Bromo-8-(4-[(3)H]methoxybenzamido)-4-oxo-4H-chromene-2-carboxylic Acid: a powerful tool for studying orphan G protein-coupled receptor GPR35. J Med Chem56:7084-99 (2013) 
 
G-protein coupled receptor 35
Name:G-protein coupled receptor 35
Type:Enzyme Catalytic Domain
Mol. Mass.:34085.57
Organism:Homo sapiens (Human)
Description:gi_33695097
Residue:309
BDBM61632
NameBDBM61632
Synonyms:5-[(E)-(tert-butylthiocarbamoylhydrazono)methyl]-1-(2,4-difluorophenyl)pyrazole-4-carboxylic acid methyl ester 5-[[[(tert-butylamino)-sulfanylidenemethyl]hydrazinylidene]methyl]-1-(2,4-difluorophenyl)-4-pyrazolecarboxylic acid methyl ester SMR000461569 methyl 1-[2,4-bis(fluoranyl)phenyl]-5-[(tert-butylcarbamothioylhydrazinylidene)methyl]pyrazole-4-carboxylate methyl 5-{2-[(tert-butylamino)carbothioyl]carbohydrazonoyl}-1-(2,4-difluorophenyl)-1H-pyrazole-4-carboxylate
TypeSmall organic molecule
Emp. Form.C17H19F2N5O2S
Mol. Mass.395.427
SMILESCOC(=O)c1cnn(c1C=NNC(=S)NC(C)(C)C)-c1ccc(F)cc1F