Reaction Details
TargetG-protein coupled receptor 35
LigandBDBM25902
Substrate/Competitorn/a
Meas. Tech.ChEMBL_983069 (CHEMBL2427429)
EC50 6200±n/a nM
Citation Thimm, DFunke, MMeyer, AMüller, CE 6-Bromo-8-(4-[(3)H]methoxybenzamido)-4-oxo-4H-chromene-2-carboxylic Acid: a powerful tool for studying orphan G protein-coupled receptor GPR35. J Med Chem56:7084-99 (2013) 
 
G-protein coupled receptor 35
Name:G-protein coupled receptor 35
Type:Enzyme Catalytic Domain
Mol. Mass.:34085.57
Organism:Homo sapiens (Human)
Description:gi_33695097
Residue:309
BDBM25902
NameBDBM25902
Synonyms:4-chloro-2-[(furan-2-ylmethyl)amino]-5-sulfamoylbenzoic acid Frusemide Furosemide Furosemide, 4 US10172837, Furosemide
TypeSmall organic molecule
Emp. Form.C12H11ClN2O5S
Mol. Mass.330.744
SMILESNS(=O)(=O)c1cc(C(O)=O)c(NCc2ccco2)cc1Cl