Reaction Details
TargetG-protein coupled receptor 35
LigandBDBM50440040
Substrate/Competitorn/a
Meas. Tech.ChEMBL_982934 (CHEMBL2429574)
Ki 0.589000±n/a nM
Citation Thimm, DFunke, MMeyer, AMüller, CE 6-Bromo-8-(4-[(3)H]methoxybenzamido)-4-oxo-4H-chromene-2-carboxylic Acid: a powerful tool for studying orphan G protein-coupled receptor GPR35. J Med Chem56:7084-99 (2013) 
 
G-protein coupled receptor 35
Name:G-protein coupled receptor 35
Type:Enzyme Catalytic Domain
Mol. Mass.:34085.57
Organism:Homo sapiens (Human)
Description:gi_33695097
Residue:309
BDBM50440040
NameBDBM50440040
Synonyms:CHEMBL2425821
TypeSmall organic molecule
Emp. Form.C18H10BrF2NO6
Mol. Mass.454.176
SMILESCOc1cc(F)c(C(=O)Nc2cc(Br)cc3c2oc(cc3=O)C(O)=O)c(F)c1