Reaction Details
TargetG-protein coupled receptor 35
LigandBDBM50436019
Substrate/Competitorn/a
Meas. Tech.ChEMBL_982934 (CHEMBL2429574)
Ki 98±n/a nM
Citation Thimm, DFunke, MMeyer, AMüller, CE 6-Bromo-8-(4-[(3)H]methoxybenzamido)-4-oxo-4H-chromene-2-carboxylic Acid: a powerful tool for studying orphan G protein-coupled receptor GPR35. J Med Chem56:7084-99 (2013) 
 
G-protein coupled receptor 35
Name:G-protein coupled receptor 35
Type:Enzyme Catalytic Domain
Mol. Mass.:34085.57
Organism:Homo sapiens (Human)
Description:gi_33695097
Residue:309
BDBM50436019
NameBDBM50436019
Synonyms:CHEMBL2392175
TypeSmall organic molecule
Emp. Form.C19H14BrNO6
Mol. Mass.432.222
SMILESCCOc1ccc(cc1)C(=O)Nc1cc(Br)cc2c1oc(cc2=O)C(O)=O