Reaction Details
TargetG-protein coupled receptor 35
LigandBDBM50436007
Substrate/Competitorn/a
Meas. Tech.ChEMBL_982934 (CHEMBL2429574)
Ki 5.5±n/a nM
Citation Thimm, DFunke, MMeyer, AMüller, CE 6-Bromo-8-(4-[(3)H]methoxybenzamido)-4-oxo-4H-chromene-2-carboxylic Acid: a powerful tool for studying orphan G protein-coupled receptor GPR35. J Med Chem56:7084-99 (2013) 
 
G-protein coupled receptor 35
Name:G-protein coupled receptor 35
Type:Enzyme Catalytic Domain
Mol. Mass.:34085.57
Organism:Homo sapiens (Human)
Description:gi_33695097
Residue:309
BDBM50436007
NameBDBM50436007
Synonyms:CHEMBL2392167
TypeSmall organic molecule
Emp. Form.C18H12ClNO6
Mol. Mass.373.744
SMILESCOc1ccc(cc1)C(=O)Nc1cc(Cl)cc2c1oc(cc2=O)C(O)=O