Reaction Details
TargetG-protein coupled receptor 35
LigandBDBM50436017
Substrate/Competitorn/a
Meas. Tech.ChEMBL_982934 (CHEMBL2429574)
Ki 233±n/a nM
Citation Thimm, DFunke, MMeyer, AMüller, CE 6-Bromo-8-(4-[(3)H]methoxybenzamido)-4-oxo-4H-chromene-2-carboxylic Acid: a powerful tool for studying orphan G protein-coupled receptor GPR35. J Med Chem56:7084-99 (2013) 
 
G-protein coupled receptor 35
Name:G-protein coupled receptor 35
Type:Enzyme Catalytic Domain
Mol. Mass.:34085.57
Organism:Homo sapiens (Human)
Description:gi_33695097
Residue:309
BDBM50436017
NameBDBM50436017
Synonyms:CHEMBL2392158
TypeSmall organic molecule
Emp. Form.C17H10BrNO5
Mol. Mass.388.169
SMILESOC(=O)c1cc(=O)c2cccc(NC(=O)c3ccc(Br)cc3)c2o1