Reaction Details
TargetGlutamate receptor ionotropic, NMDA 2A
LigandBDBM50440054
Substrate/Competitorn/a
Meas. Tech.ChEMBL_983746 (CHEMBL2427899)
IC50 156000±n/a nM
Citation Acker, TMKhatri, AVance, KMSlabber, CBacsa, JSnyder, JPTraynelis, SFLiotta, DC Structure-activity relationships and pharmacophore model of a noncompetitive pyrazoline containing class of GluN2C/GluN2D selective antagonists. J Med Chem56:6434-56 (2013) 
 
Glutamate receptor ionotropic, NMDA 2A
Name:Glutamate receptor ionotropic, NMDA 2A
Type:Protein
Mol. Mass.:165478.25
Organism:Rattus norvegicus (Rat)
Description:Q00959
Residue:1464
BDBM50440054
NameBDBM50440054
Synonyms:CHEMBL2426103
TypeSmall organic molecule
Emp. Form.C29H21ClN4O4
Mol. Mass.524.954
SMILESOC(=O)CCC(=O)N1N=C(CC1c1ccc(Cl)cc1)c1c(-c2ccc(cc2)C#N)c2ccccc2[nH]c1=O