Reaction Details
TargetGlutamate receptor ionotropic, NMDA 2A
LigandBDBM50440055
Substrate/Competitorn/a
Meas. Tech.ChEMBL_983746 (CHEMBL2427899)
IC50 62000±n/a nM
Citation Acker, TMKhatri, AVance, KMSlabber, CBacsa, JSnyder, JPTraynelis, SFLiotta, DC Structure-activity relationships and pharmacophore model of a noncompetitive pyrazoline containing class of GluN2C/GluN2D selective antagonists. J Med Chem56:6434-56 (2013) 
 
Glutamate receptor ionotropic, NMDA 2A
Name:Glutamate receptor ionotropic, NMDA 2A
Type:Protein
Mol. Mass.:165478.25
Organism:Rattus norvegicus (Rat)
Description:Q00959
Residue:1464
BDBM50440055
NameBDBM50440055
Synonyms:CHEMBL2426102
TypeSmall organic molecule
Emp. Form.C29H24ClN3O5
Mol. Mass.529.971
SMILESCOc1ccc(cc1)-c1c(C2=NN(C(C2)c2ccc(Cl)cc2)C(=O)CCC(O)=O)c(=O)[nH]c2ccccc12