Reaction Details
TargetGlutamate receptor ionotropic, NMDA 2A
LigandBDBM50440067
Substrate/Competitorn/a
Meas. Tech.ChEMBL_983746 (CHEMBL2427899)
IC50 4300±n/a nM
Citation Acker, TMKhatri, AVance, KMSlabber, CBacsa, JSnyder, JPTraynelis, SFLiotta, DC Structure-activity relationships and pharmacophore model of a noncompetitive pyrazoline containing class of GluN2C/GluN2D selective antagonists. J Med Chem56:6434-56 (2013) 
 
Glutamate receptor ionotropic, NMDA 2A
Name:Glutamate receptor ionotropic, NMDA 2A
Type:Protein
Mol. Mass.:165478.25
Organism:Rattus norvegicus (Rat)
Description:Q00959
Residue:1464
BDBM50440067
NameBDBM50440067
Synonyms:CHEMBL2426072 | CHEMBL2426073
TypeSmall organic molecule
Emp. Form.C28H19BrClN3O4
Mol. Mass.576.825
SMILESOC(=O)C=CC(=O)N1N=C(CC1c1ccc(Cl)cc1)c1c(-c2ccc(Br)cc2)c2ccccc2[nH]c1=O