Reaction Details
TargetGlutamate receptor ionotropic, NMDA 2B
LigandBDBM50440085
Substrate/Competitorn/a
Meas. Tech.ChEMBL_983747 (CHEMBL2427900)
IC50 23000±n/a nM
Citation Acker, TMKhatri, AVance, KMSlabber, CBacsa, JSnyder, JPTraynelis, SFLiotta, DC Structure-activity relationships and pharmacophore model of a noncompetitive pyrazoline containing class of GluN2C/GluN2D selective antagonists. J Med Chem56:6434-56 (2013) 
 
Glutamate receptor ionotropic, NMDA 2B
Name:Glutamate receptor ionotropic, NMDA 2B
Type:Protein
Mol. Mass.:166077.66
Organism:Rattus norvegicus (Rat)
Description:Q00960
Residue:1482
BDBM50440085
NameBDBM50440085
Synonyms:CHEMBL2426092
TypeSmall organic molecule
Emp. Form.C28H21Br2N3O4
Mol. Mass.623.292
SMILESOC(=O)CCC(=O)N1N=C(CC1c1ccc(Br)cc1)c1c(-c2ccc(Br)cc2)c2ccccc2[nH]c1=O