Reaction Details
TargetGlutamate receptor ionotropic, NMDA 2D
LigandBDBM50440090
Substrate/Competitorn/a
Meas. Tech.ChEMBL_983749 (CHEMBL2427902)
IC50 32000±n/a nM
Citation Acker, TMKhatri, AVance, KMSlabber, CBacsa, JSnyder, JPTraynelis, SFLiotta, DC Structure-activity relationships and pharmacophore model of a noncompetitive pyrazoline containing class of GluN2C/GluN2D selective antagonists. J Med Chem56:6434-56 (2013) 
 
Glutamate receptor ionotropic, NMDA 2D
Name:Glutamate receptor ionotropic, NMDA 2D
Type:Protein
Mol. Mass.:143129.52
Organism:Rattus norvegicus (Rat)
Description:Q62645
Residue:1323
BDBM50440090
NameBDBM50440090
Synonyms:CHEMBL2426088
TypeSmall organic molecule
Emp. Form.C30H24ClN3O6
Mol. Mass.557.981
SMILESCOC(=O)c1ccc(cc1)C1CC(=NN1C(=O)CCC(O)=O)c1c(-c2ccccc2)c2cc(Cl)ccc2[nH]c1=O