Reaction Details
TargetGlutamate receptor ionotropic, NMDA 2C
LigandBDBM53906
Substrate/Competitorn/a
Meas. Tech.ChEMBL_983748 (CHEMBL2427901)
IC50 86000±n/a nM
Citation Acker, TMKhatri, AVance, KMSlabber, CBacsa, JSnyder, JPTraynelis, SFLiotta, DC Structure-activity relationships and pharmacophore model of a noncompetitive pyrazoline containing class of GluN2C/GluN2D selective antagonists. J Med Chem56:6434-56 (2013) 
 
Glutamate receptor ionotropic, NMDA 2C
Name:Glutamate receptor ionotropic, NMDA 2C
Type:Protein
Mol. Mass.:135305.94
Organism:Rattus norvegicus (Rat)
Description:Q00961
Residue:1237
BDBM53906
NameBDBM53906
Synonyms:4-[(3E)-3-(6-chloranyl-2-oxidanylidene-4-phenyl-quinolin-3-ylidene)-5-phenyl-pyrazolidin-1-yl]-4-oxidanylidene-butanoic acid 4-[(3E)-3-(6-chloro-2-oxo-4-phenyl-3-quinolinylidene)-5-phenyl-1-pyrazolidinyl]-4-oxobutanoic acid CHEMBL1332173 SMR000273564 | cid_5344006
TypeSmall organic molecule
Emp. Form.C28H22ClN3O4
Mol. Mass.499.945
SMILESOC(=O)CCC(=O)N1N=C(CC1c1ccccc1)c1c(-c2ccccc2)c2cc(Cl)ccc2[nH]c1=O