Reaction Details
TargetGlucocorticoid receptor
LigandBDBM50440109
Substrate/Competitorn/a
Meas. Tech.ChEMBL_983770 (CHEMBL2428109)
Ki 2.4±n/a nM
Citation Gilmore, JLSheppeck, JEWang, JDhar, TGCavallaro, CDoweyko, AMMckay, LCunningham, MDHabte, SFNadler, SGDodd, JHSomerville, JEBarrish, JC Synthesis and structure-activity relationships of novel indazolyl glucocorticoid receptor partial agonists. Bioorg Med Chem Lett23:5448-51 (2013) 
 
Glucocorticoid receptor
Name:Glucocorticoid receptor
Type:Enzyme
Mol. Mass.:85656.87
Organism:Homo sapiens (Human)
Description:P04150
Residue:777
BDBM50440109
NameBDBM50440109
Synonyms:CHEMBL2426109
TypeSmall organic molecule
Emp. Form.C26H23F4N3O
Mol. Mass.469.4739
SMILESCC(CNC(=O)CC(F)(F)F)[C@@H](c1ccccc1)c1ccc2n(ncc2c1)-c1ccc(F)cc1