Reaction Details
TargetTyrosine-protein kinase SYK
LigandBDBM50132450
Substrate/Competitorn/a
Meas. Tech.ChEMBL_983771 (CHEMBL2428110)
IC50 5.0±n/a nM
Citation Kaur, MSingh, MSilakari, O Inhibitors of switch kinase 'spleen tyrosine kinase' in inflammation and immune-mediated disorders: a review. Eur J Med Chem67:434-46 (2013) 
 
Tyrosine-protein kinase SYK
Name:Tyrosine-protein kinase SYK
Type:Enzyme
Mol. Mass.:72079.99
Organism:Homo sapiens (Human)
Description:P43405
Residue:635
BDBM50132450
NameBDBM50132450
Synonyms:3-[1-(5-Methoxy-1-methyl-1H-indol-3-yl)-meth-(Z)-ylidene]-2-oxo-2,3-dihydro-1H-indole-5-sulfonic acid amide | CHEMBL104333
TypeSmall organic molecule
Emp. Form.C19H17N3O4S
Mol. Mass.383.421
SMILESCOc1ccc2n(C)cc(\C=C3/C(=O)Nc4ccc(cc34)S(N)(=O)=O)c2c1