Reaction Details
TargetDeoxycytidine kinase
LigandBDBM50440154
Substrate/Competitorn/a
Meas. Tech.ChEMBL_981695 (CHEMBL2429677)
IC50 620±n/a nM
Citation Murphy, JMArmijo, ALNomme, JLee, CHSmith, QALi, ZCampbell, DOLiao, HINathanson, DAAustin, WRLee, JTDarvish, RWei, LWang, JSu, YDamoiseaux, RSadeghi, SPhelps, MEHerschman, HRCzernin, JAlexandrova, ANJung, MELavie, ARadu, CG Development of new deoxycytidine kinase inhibitors and noninvasive in vivo evaluation using positron emission tomography. J Med Chem56:6696-708 (2013) 
 
Deoxycytidine kinase
Name:Deoxycytidine kinase
Type:PROTEIN
Mol. Mass.:30361.42
Organism:Mus musculus
Description:ChEMBL_981695
Residue:260
BDBM50440154
NameBDBM50440154
Synonyms:CHEMBL2426459
TypeSmall organic molecule
Emp. Form.C16H15F2N5S2
Mol. Mass.379.451
SMILESCCc1sc(nc1CSc1nc(N)cc(N)n1)-c1cc(F)cc(F)c1