Reaction Details
TargetDeoxycytidine kinase
LigandBDBM50440144
Substrate/Competitorn/a
Meas. Tech.ChEMBL_981695 (CHEMBL2429677)
IC50 2381±n/a nM
Citation Murphy, JMArmijo, ALNomme, JLee, CHSmith, QALi, ZCampbell, DOLiao, HINathanson, DAAustin, WRLee, JTDarvish, RWei, LWang, JSu, YDamoiseaux, RSadeghi, SPhelps, MEHerschman, HRCzernin, JAlexandrova, ANJung, MELavie, ARadu, CG Development of new deoxycytidine kinase inhibitors and noninvasive in vivo evaluation using positron emission tomography. J Med Chem56:6696-708 (2013) 
 
Deoxycytidine kinase
Name:Deoxycytidine kinase
Type:PROTEIN
Mol. Mass.:30361.42
Organism:Mus musculus
Description:ChEMBL_981695
Residue:260
BDBM50440144
NameBDBM50440144
Synonyms:CHEMBL2426584
TypeSmall organic molecule
Emp. Form.C17H18FN5OS2
Mol. Mass.391.486
SMILESCc1ccc(cc1OCCF)-c1nc(CSc2nc(N)cc(N)n2)cs1