Reaction Details
TargetDeoxycytidine kinase
LigandBDBM50440170
Substrate/Competitorn/a
Meas. Tech.ChEMBL_981695 (CHEMBL2429677)
IC50>100000±n/a nM
Citation Murphy, JMArmijo, ALNomme, JLee, CHSmith, QALi, ZCampbell, DOLiao, HINathanson, DAAustin, WRLee, JTDarvish, RWei, LWang, JSu, YDamoiseaux, RSadeghi, SPhelps, MEHerschman, HRCzernin, JAlexandrova, ANJung, MELavie, ARadu, CG Development of new deoxycytidine kinase inhibitors and noninvasive in vivo evaluation using positron emission tomography. J Med Chem56:6696-708 (2013) 
 
Deoxycytidine kinase
Name:Deoxycytidine kinase
Type:PROTEIN
Mol. Mass.:30361.42
Organism:Mus musculus
Description:ChEMBL_981695
Residue:260
BDBM50440170
NameBDBM50440170
Synonyms:CHEMBL2426579
TypeSmall organic molecule
Emp. Form.C14H11N3S2
Mol. Mass.285.387
SMILESC(Sc1ncccn1)c1csc(n1)-c1ccccc1