Reaction Details
TargetDeoxycytidine kinase
LigandBDBM50440149
Substrate/Competitorn/a
Meas. Tech.ChEMBL_981694 (CHEMBL2429676)
IC50 37±n/a nM
Citation Murphy, JMArmijo, ALNomme, JLee, CHSmith, QALi, ZCampbell, DOLiao, HINathanson, DAAustin, WRLee, JTDarvish, RWei, LWang, JSu, YDamoiseaux, RSadeghi, SPhelps, MEHerschman, HRCzernin, JAlexandrova, ANJung, MELavie, ARadu, CG Development of new deoxycytidine kinase inhibitors and noninvasive in vivo evaluation using positron emission tomography. J Med Chem56:6696-708 (2013) 
 
Deoxycytidine kinase
Name:Deoxycytidine kinase
Type:PROTEIN
Mol. Mass.:30510.65
Organism:Homo sapiens (Human)
Description:ChEMBL_1437135
Residue:260
BDBM50440149
NameBDBM50440149
Synonyms:CHEMBL2426560
TypeSmall organic molecule
Emp. Form.C17H18FN5S2
Mol. Mass.375.487
SMILESCCCc1sc(nc1CSc1nc(N)cc(N)n1)-c1ccc(F)cc1