Reaction Details
TargetMetabotropic glutamate receptor 5
LigandBDBM36181
Substrate/Competitorn/a
Meas. Tech.ChEMBL_981749 (CHEMBL2426830)
EC50>10000±n/a nM
Citation Bartolomé-Nebreda, JMConde-Ceide, SDelgado, FIturrino, LPastor, JPena, MÁTrabanco, AATresadern, GWassvik, CMStauffer, SRJadhav, SGogi, KVinson, PNNoetzel, MJDays, EWeaver, CDLindsley, CWNiswender, CMJones, CKConn, PJRombouts, FLavreysen, HMacdonald, GJMackie, CSteckler, T Dihydrothiazolopyridone derivatives as a novel family of positive allosteric modulators of the metabotropic glutamate 5 (mGlu5) receptor. J Med Chem56:7243-59 (2013) 
 
Metabotropic glutamate receptor 5
Name:Metabotropic glutamate receptor 5
Type:Enzyme
Mol. Mass.:132484.72
Organism:Homo sapiens (Human)
Description:n/a
Residue:1212
BDBM36181
NameBDBM36181
Synonyms:SODIUM BENZOATE benzoic acid | benzoic acid-d5
TypeGuest
Emp. Form.C7H5O2
Mol. Mass.121.1139
SMILES[O-]C(=O)c1ccccc1