Reaction Details
TargetGlucocorticoid receptor
LigandBDBM50440230
Substrate/Competitorn/a
Meas. Tech.ChEMBL_982006 (CHEMBL2428210)
EC50 705±n/a nM
Citation Sheppeck, JEGilmore, JLXiao, HYDhar, TGNirschl, DDoweyko, AMSack, JSCorbett, MJMalley, MFGougoutas, JZMckay, LCunningham, MDHabte, SFDodd, JHNadler, SGSomerville, JEBarrish, JC Discovery of potent and selective nonsteroidal indazolyl amide glucocorticoid receptor agonists. Bioorg Med Chem Lett23:5442-7 (2013) 
 
Glucocorticoid receptor
Name:Glucocorticoid receptor
Type:Enzyme
Mol. Mass.:85656.87
Organism:Homo sapiens (Human)
Description:P04150
Residue:777
BDBM50440230
NameBDBM50440230
Synonyms:CHEMBL2426639
TypeSmall organic molecule
Emp. Form.C27H24FN5OS
Mol. Mass.485.576
SMILESCC(C)(C(Cc1ccccc1)c1ccc2n(ncc2c1)-c1ccc(F)cc1)C(=O)Nc1nncs1