Reaction Details
TargetGrowth hormone secretagogue receptor type 1
LigandBDBM50440247
Substrate/Competitorn/a
Meas. Tech.ChEMBL_982014 (CHEMBL2428369)
Ki 16±n/a nM
Citation McClure, KFJackson, MCameron, KOKung, DWPerry, DAOrr, STZhang, YKohrt, JTu, MGao, HFernando, DJones, RErasga, NWang, GPolivkova, JJiao, WSwartz, RUeno, HBhattacharya, SKStock, IAVarma, SBagdasarian, VPerez, SKelly-Sullivan, DWang, RKong, JCornelius, PMichael, LLee, EJanssen, ASteyn, SJLapham, KGoosen, T Identification of potent, selective, CNS-targeted inverse agonists of the ghrelin receptor. Bioorg Med Chem Lett23:5410-4 (2013) 
 
Growth hormone secretagogue receptor type 1
Name:Growth hormone secretagogue receptor type 1
Type:Receptor
Mol. Mass.:41334.57
Organism:Homo sapiens (Human)
Description:Receptor binding studies use plasma membranes from LLC PK-1 cells transiently transfected with hGHSR1a.
Residue:366
BDBM50440247
NameBDBM50440247
Synonyms:CHEMBL2426666
TypeSmall organic molecule
Emp. Form.C27H32N6O
Mol. Mass.456.5826
SMILESCCc1ccc(CC(=O)N2CCC3(CN(C3)[C@@H]3CCc4cc(ccc34)-n3nccn3)CC2)nc1