Reaction Details
TargetMuscarinic acetylcholine receptor M2
LigandBDBM50005341
Substrate/Competitorn/a
Meas. Tech.ChEMBL_982012 (CHEMBL2428367)
Ki 1622±n/a nM
Citation McClure, KFJackson, MCameron, KOKung, DWPerry, DAOrr, STZhang, YKohrt, JTu, MGao, HFernando, DJones, RErasga, NWang, GPolivkova, JJiao, WSwartz, RUeno, HBhattacharya, SKStock, IAVarma, SBagdasarian, VPerez, SKelly-Sullivan, DWang, RKong, JCornelius, PMichael, LLee, EJanssen, ASteyn, SJLapham, KGoosen, T Identification of potent, selective, CNS-targeted inverse agonists of the ghrelin receptor. Bioorg Med Chem Lett23:5410-4 (2013) 
 
Muscarinic acetylcholine receptor M2
Name:Muscarinic acetylcholine receptor M2
Type:GPCR
Mol. Mass.:51730.61
Organism:Homo sapiens (Human)
Description:P08172
Residue:466
BDBM50005341
NameBDBM50005341
Synonyms:CHEMBL2426678
TypeSmall organic molecule
Emp. Form.C28H31N5O2
Mol. Mass.469.578
SMILESCOc1ccc(CC(=O)N2CCC3(CN(C3)C3CCc4cc(ccc34)-c3ncccn3)CC2)nc1