Reaction Details
TargetRibosyldihydronicotinamide dehydrogenase [quinone]
LigandBDBM50440268
Substrate/Competitorn/a
Meas. Tech.ChEMBL_982298 (CHEMBL2429516)
IC50 730±n/a nM
Citation St John, SEJensen, KCKang, SChen, YCalamini, BMesecar, ADLipton, MA Design, synthesis, biological and structural evaluation of functionalized resveratrol analogues as inhibitors of quinone reductase 2. Bioorg Med Chem21:6022-37 (2013) 
 
Ribosyldihydronicotinamide dehydrogenase [quinone]
Name:Ribosyldihydronicotinamide dehydrogenase [quinone]
Type:Protein
Mol. Mass.:25917.25
Organism:Homo sapiens (Human)
Description:P16083
Residue:231
BDBM50440268
NameBDBM50440268
Synonyms:2-(3,5-Dimethoxystyryl)Naphthalene | CHEMBL473724
TypeSmall organic molecule
Emp. Form.C20H18O2
Mol. Mass.290.3557
SMILESCOc1cc(OC)cc(\C=C\c2ccc3ccccc3c2)c1