Reaction Details
TargetRibosyldihydronicotinamide dehydrogenase [quinone]
LigandBDBM23933
Substrate/Competitorn/a
Meas. Tech.ChEMBL_982298 (CHEMBL2429516)
IC50 4600±n/a nM
Citation St John, SEJensen, KCKang, SChen, YCalamini, BMesecar, ADLipton, MA Design, synthesis, biological and structural evaluation of functionalized resveratrol analogues as inhibitors of quinone reductase 2. Bioorg Med Chem21:6022-37 (2013) 
 
Ribosyldihydronicotinamide dehydrogenase [quinone]
Name:Ribosyldihydronicotinamide dehydrogenase [quinone]
Type:Protein
Mol. Mass.:25917.25
Organism:Homo sapiens (Human)
Description:P16083
Residue:231
BDBM23933
NameBDBM23933
Synonyms:1-[(E)-2-(4-fluorophenyl)ethenyl]-3,5-dimethoxybenzene | trans-Stilbene Derivative, 4f
TypeSmall organic molecule
Emp. Form.C16H15FO2
Mol. Mass.258.2875
SMILESCOc1cc(OC)cc(\C=C\c2ccc(F)cc2)c1