Reaction Details
TargetRibosyldihydronicotinamide dehydrogenase [quinone]
LigandBDBM50085526
Substrate/Competitorn/a
Meas. Tech.ChEMBL_982298 (CHEMBL2429516)
IC50 37100±n/a nM
Citation St John, SEJensen, KCKang, SChen, YCalamini, BMesecar, ADLipton, MA Design, synthesis, biological and structural evaluation of functionalized resveratrol analogues as inhibitors of quinone reductase 2. Bioorg Med Chem21:6022-37 (2013) 
 
Ribosyldihydronicotinamide dehydrogenase [quinone]
Name:Ribosyldihydronicotinamide dehydrogenase [quinone]
Type:Protein
Mol. Mass.:25917.25
Organism:Homo sapiens (Human)
Description:P16083
Residue:231
BDBM50085526
NameBDBM50085526
Synonyms:(E)-3,5,30,40-Tetramethoxystilbene 4-[2-(3,5-dimethoxyphenyl)-(E)-1-ethenyl]-1,2-dimethoxybenzene | CHEMBL44509
TypeSmall organic molecule
Emp. Form.C18H20O4
Mol. Mass.300.349
SMILESCOc1cc(OC)cc(\C=C\c2ccc(OC)c(OC)c2)c1