Reaction Details
TargetRibosyldihydronicotinamide dehydrogenase [quinone]
LigandBDBM50440279
Substrate/Competitorn/a
Meas. Tech.ChEMBL_982298 (CHEMBL2429516)
IC50 16300±n/a nM
Citation St John, SEJensen, KCKang, SChen, YCalamini, BMesecar, ADLipton, MA Design, synthesis, biological and structural evaluation of functionalized resveratrol analogues as inhibitors of quinone reductase 2. Bioorg Med Chem21:6022-37 (2013) 
 
Ribosyldihydronicotinamide dehydrogenase [quinone]
Name:Ribosyldihydronicotinamide dehydrogenase [quinone]
Type:Protein
Mol. Mass.:25917.25
Organism:Homo sapiens (Human)
Description:P16083
Residue:231
BDBM50440279
NameBDBM50440279
Synonyms:CHEMBL470939
TypeSmall organic molecule
Emp. Form.C20H24O4
Mol. Mass.328.4022
SMILESCC\C(=C/c1cc(OC)cc(OC)c1)c1ccc(OC)c(OC)c1