Reaction Details
TargetRibosyldihydronicotinamide dehydrogenase [quinone]
LigandBDBM50247189
Substrate/Competitorn/a
Meas. Tech.ChEMBL_982298 (CHEMBL2429516)
IC50 33700±n/a nM
Citation St John, SEJensen, KCKang, SChen, YCalamini, BMesecar, ADLipton, MA Design, synthesis, biological and structural evaluation of functionalized resveratrol analogues as inhibitors of quinone reductase 2. Bioorg Med Chem21:6022-37 (2013) 
 
Ribosyldihydronicotinamide dehydrogenase [quinone]
Name:Ribosyldihydronicotinamide dehydrogenase [quinone]
Type:Protein
Mol. Mass.:25917.25
Organism:Homo sapiens (Human)
Description:P16083
Residue:231
BDBM50247189
NameBDBM50247189
Synonyms:5-(2-(3,4-dimethoxyphenyl)prop-1-enyl)benzene-1,3-diol | CHEMBL475135
TypeSmall organic molecule
Emp. Form.C17H18O4
Mol. Mass.286.3224
SMILESCOc1ccc(cc1OC)C(\C)=C\c1cc(O)cc(O)c1