Reaction Details
TargetLysine-specific demethylase 6A
LigandBDBM50440292
Substrate/Competitorn/a
Meas. Tech.ChEMBL_982480 (CHEMBL2427606)
IC50>100000±n/a nM
Citation Suzuki, TOzasa, HItoh, YZhan, PSawada, HMino, KWalport, LOhkubo, RKawamura, AYonezawa, MTsukada, YTumber, ANakagawa, HHasegawa, MSasaki, RMizukami, TSchofield, CJMiyata, N Identification of the KDM2/7 histone lysine demethylase subfamily inhibitor and its antiproliferative activity. J Med Chem56:7222-31 (2013) 
 
Lysine-specific demethylase 6A
Name:Lysine-specific demethylase 6A
Type:Protein
Mol. Mass.:154198.48
Organism:Homo sapiens (Human)
Description:O15550
Residue:1401
BDBM50440292
NameBDBM50440292
Synonyms:CHEMBL2424809
TypeSmall organic molecule
Emp. Form.C15H29NO4
Mol. Mass.287.3951
SMILESCC(C)CCCCCCCCC(=O)N(O)CCC(O)=O