Reaction Details
TargetLysine-specific demethylase 2A
LigandBDBM50440289
Substrate/Competitorn/a
Meas. Tech.ChEMBL_982479 (CHEMBL2427605)
IC50 6800±n/a nM
Citation Suzuki, TOzasa, HItoh, YZhan, PSawada, HMino, KWalport, LOhkubo, RKawamura, AYonezawa, MTsukada, YTumber, ANakagawa, HHasegawa, MSasaki, RMizukami, TSchofield, CJMiyata, N Identification of the KDM2/7 histone lysine demethylase subfamily inhibitor and its antiproliferative activity. J Med Chem56:7222-31 (2013) 
 
Lysine-specific demethylase 2A
Name:Lysine-specific demethylase 2A
Type:Enzyme Catalytic Domain
Mol. Mass.:132809.04
Organism:Homo sapiens (Human)
Description:n/a
Residue:1162
BDBM50440289
NameBDBM50440289
Synonyms:CHEMBL2424812
TypeSmall organic molecule
Emp. Form.C15H27NO4
Mol. Mass.285.3792
SMILESON(CCC(O)=O)C(=O)CCCCCCCCC1CC1