Reaction Details
TargetLysine-specific demethylase 2A
LigandBDBM50440292
Substrate/Competitorn/a
Meas. Tech.ChEMBL_982479 (CHEMBL2427605)
IC50 8100±n/a nM
Citation Suzuki, TOzasa, HItoh, YZhan, PSawada, HMino, KWalport, LOhkubo, RKawamura, AYonezawa, MTsukada, YTumber, ANakagawa, HHasegawa, MSasaki, RMizukami, TSchofield, CJMiyata, N Identification of the KDM2/7 histone lysine demethylase subfamily inhibitor and its antiproliferative activity. J Med Chem56:7222-31 (2013) 
 
Lysine-specific demethylase 2A
Name:Lysine-specific demethylase 2A
Type:Enzyme Catalytic Domain
Mol. Mass.:132809.04
Organism:Homo sapiens (Human)
Description:n/a
Residue:1162
BDBM50440292
NameBDBM50440292
Synonyms:CHEMBL2424809
TypeSmall organic molecule
Emp. Form.C15H29NO4
Mol. Mass.287.3951
SMILESCC(C)CCCCCCCCC(=O)N(O)CCC(O)=O