Reaction Details
TargetLysine-specific demethylase 4A
LigandBDBM26113
Substrate/Competitorn/a
Meas. Tech.ChEMBL_982483 (CHEMBL2427609)
IC50 4200±n/a nM
Citation Suzuki, TOzasa, HItoh, YZhan, PSawada, HMino, KWalport, LOhkubo, RKawamura, AYonezawa, MTsukada, YTumber, ANakagawa, HHasegawa, MSasaki, RMizukami, TSchofield, CJMiyata, N Identification of the KDM2/7 histone lysine demethylase subfamily inhibitor and its antiproliferative activity. J Med Chem56:7222-31 (2013) 
 
Lysine-specific demethylase 4A
Name:Lysine-specific demethylase 4A
Type:Enzyme
Mol. Mass.:120647.83
Organism:Homo sapiens (Human)
Description:O75164
Residue:1064
BDBM26113
NameBDBM26113
Synonyms:2,4 PDCA pyridine carboxylate, 6a | pyridine-2,4-dicarboxylic acid
TypeSmall organic molecule
Emp. Form.C7H5NO4
Mol. Mass.167.1189
SMILESOC(=O)c1ccnc(c1)C(O)=O