Reaction Details
TargetPeptidyl-prolyl cis-trans isomerase B
LigandBDBM50440293
Substrate/Competitorn/a
Meas. Tech.ChEMBL_982569 (CHEMBL2428072)
Ki 35±n/a nM
Citation Malesevic, MGutknecht, DPrell, EKlein, CSchumann, MNowak, RASimon, JCSchiene-Fischer, CSaalbach, A Anti-inflammatory effects of extracellular cyclosporins are exclusively mediated by CD147. J Med Chem56:7302-11 (2013) 
 
Peptidyl-prolyl cis-trans isomerase B
Name:Peptidyl-prolyl cis-trans isomerase B
Type:Protein
Mol. Mass.:23751.82
Organism:Homo sapiens (Human)
Description:P23284
Residue:216
BDBM50440293
NameBDBM50440293
Synonyms:CHEMBL2424822
TypeSmall organic molecule
Emp. Form.C67H111N13O14
Mol. Mass.1322.6769
SMILESCC[C@@H]1NC(=O)[C@H]([C@H](O)[C@H](C)Cc2nc3ccc(cc3[nH]2)C(O)=O)N(C)C(=O)[C@H](C(C)C)N(C)C(=O)[C@H](CC(C)C)N(C)C(=O)[C@H](CC(C)C)N(C)C(=O)[C@@H](C)NC(=O)[C@H](C)NC(=O)[C@H](CC(C)C)N(C)C(=O)[C@@H](NC(=O)[C@H](CC(C)C)N(C)C(=O)CN(C)C1=O)C(C)C