Reaction Details
TargetPeptidyl-prolyl cis-trans isomerase A
LigandBDBM50440299
Substrate/Competitorn/a
Meas. Tech.ChEMBL_982571 (CHEMBL2428216)
Ki 12±n/a nM
Citation Malesevic, MGutknecht, DPrell, EKlein, CSchumann, MNowak, RASimon, JCSchiene-Fischer, CSaalbach, A Anti-inflammatory effects of extracellular cyclosporins are exclusively mediated by CD147. J Med Chem56:7302-11 (2013) 
 
Peptidyl-prolyl cis-trans isomerase A
Name:Peptidyl-prolyl cis-trans isomerase A
Type:Protein
Mol. Mass.:18015.32
Organism:Homo sapiens (Human)
Description:P62937
Residue:165
BDBM50440299
NameBDBM50440299
Synonyms:CHEMBL2424823
TypeSmall organic molecule
Emp. Form.C67H113N13O12
Mol. Mass.1292.694
SMILESCC[C@@H]1NC(=O)[C@H]([C@H](O)[C@H](C)Cc2nc3ccc(C)cc3[nH]2)N(C)C(=O)[C@H](C(C)C)N(C)C(=O)[C@H](CC(C)C)N(C)C(=O)[C@H](CC(C)C)N(C)C(=O)[C@@H](C)NC(=O)[C@H](C)NC(=O)[C@H](CC(C)C)N(C)C(=O)[C@@H](NC(=O)[C@H](CC(C)C)N(C)C(=O)CN(C)C1=O)C(C)C