Reaction Details
TargetDNA topoisomerase 4 subunit A/B
LigandBDBM50440312
Substrate/Competitorn/a
Meas. Tech.ChEMBL_982977 (CHEMBL2427061)
IC50 500±n/a nM
Citation Surivet, JPZumbrunn, CRueedi, GHubschwerlen, CBur, DBruyère, TLocher, HRitz, DKeck, WSeiler, PKohl, CGauvin, JCMirre, AKaegi, VDos Santos, MGaertner, MDelers, JEnderlin-Paput, MBoehme, M Design, synthesis, and characterization of novel tetrahydropyran-based bacterial topoisomerase inhibitors with potent anti-gram-positive activity. J Med Chem56:7396-415 (2013) 
 
DNA topoisomerase 4 subunit A/B
Name:DNA topoisomerase 4 subunit A/B
Synonyms:Topoisomerase IV
Type:n/a
Mol. Mass.:n/a
Description:ASSAY_ID of ChEMBL is 2012758
Components:This complex has 2 components.
Component 1
Name:DNA topoisomerase 4 subunit A
Type:PROTEIN
Mol. Mass.:91040.14
Organism:Staphylococcus aureus
Description:ChEMBL_340188
Residue:800
Component 2
Name:DNA topoisomerase 4 subunit B
Synonyms:DNA topoisomerase 4 subunit B PARE_STAA8 grlB | parE
Type:Enzyme
Mol. Mass.:74365.92
Organism:Staphylococcus aureus
Description:Q2FYS5
Residue:663
BDBM50440312
NameBDBM50440312
Synonyms:CHEMBL2424891
TypeSmall organic molecule
Emp. Form.C25H28N4O5S
Mol. Mass.496.579
SMILESCOc1cnc2cccc([C@@H](O)[C@H](O)[C@@H]3CC[C@H](CO3)NCc3ccc4SCC(=O)Nc4n3)c2c1