Reaction Details
TargetCytochrome P450 2D6
LigandBDBM50440360
Substrate/Competitorn/a
Meas. Tech.ChEMBL_983548 (CHEMBL2429618)
IC50>10000±n/a nM
Citation Grädler, UBomke, JMusil, DDresing, VLehmann, MHölzemann, GGreiner, HEsdar, CKrier, MHeinrich, T Fragment-based discovery of focal adhesion kinase inhibitors. Bioorg Med Chem Lett23:5401-9 (2013) 
 
Cytochrome P450 2D6
Name:Cytochrome P450 2D6
Type:Protein
Mol. Mass.:55774.82
Organism:Homo sapiens (Human)
Description:P10635
Residue:497
BDBM50440360
NameBDBM50440360
Synonyms:CHEMBL2425154
TypeSmall organic molecule
Emp. Form.C22H24N8O
Mol. Mass.416.479
SMILESCc1ccc(cc1)-n1nc(cc1NC(=O)Nc1ccc(cc1)-n1cnnn1)C(C)(C)C