Reaction Details
TargetFocal adhesion kinase 1
LigandBDBM50440357
Substrate/Competitorn/a
Meas. Tech.ChEMBL_983672 (CHEMBL2427452)
IC50 5000±n/a nM
Citation Grädler, UBomke, JMusil, DDresing, VLehmann, MHölzemann, GGreiner, HEsdar, CKrier, MHeinrich, T Fragment-based discovery of focal adhesion kinase inhibitors. Bioorg Med Chem Lett23:5401-9 (2013) 
 
Focal adhesion kinase 1
Name:Focal adhesion kinase 1
Type:Tyrosine-protein kinase
Mol. Mass.:119233.17
Organism:Homo sapiens (Human)
Description:Q05397
Residue:1052
BDBM50440357
NameBDBM50440357
Synonyms:CHEMBL2425157
TypeSmall organic molecule
Emp. Form.C26H28N6O
Mol. Mass.440.5401
SMILESCc1ccc(cc1)-n1nc(cc1NC(=O)Nc1ccc(cc1)-c1ccc(N)nc1)C(C)(C)C