Reaction Details
TargetFocal adhesion kinase 1
LigandBDBM50440358
Substrate/Competitorn/a
Meas. Tech.ChEMBL_983672 (CHEMBL2427452)
IC50 7000±n/a nM
Citation Grädler, UBomke, JMusil, DDresing, VLehmann, MHölzemann, GGreiner, HEsdar, CKrier, MHeinrich, T Fragment-based discovery of focal adhesion kinase inhibitors. Bioorg Med Chem Lett23:5401-9 (2013) 
 
Focal adhesion kinase 1
Name:Focal adhesion kinase 1
Type:Tyrosine-protein kinase
Mol. Mass.:119233.17
Organism:Homo sapiens (Human)
Description:Q05397
Residue:1052
BDBM50440358
NameBDBM50440358
Synonyms:CHEMBL2425156
TypeSmall organic molecule
Emp. Form.C26H27N5O
Mol. Mass.425.5255
SMILESCc1ccc(cc1)-n1nc(cc1NC(=O)Nc1ccc(cc1)-c1cccnc1)C(C)(C)C