Reaction Details
TargetCytochrome P450 2C8
LigandBDBM50440360
Substrate/Competitorn/a
Meas. Tech.ChEMBL_983550 (CHEMBL2429620)
IC50>10000±n/a nM
Citation Grädler, UBomke, JMusil, DDresing, VLehmann, MHölzemann, GGreiner, HEsdar, CKrier, MHeinrich, T Fragment-based discovery of focal adhesion kinase inhibitors. Bioorg Med Chem Lett23:5401-9 (2013) 
 
Cytochrome P450 2C8
Name:Cytochrome P450 2C8
Type:Protein
Mol. Mass.:55839.23
Organism:Homo sapiens (Human)
Description:P10632
Residue:490
BDBM50440360
NameBDBM50440360
Synonyms:CHEMBL2425154
TypeSmall organic molecule
Emp. Form.C22H24N8O
Mol. Mass.416.479
SMILESCc1ccc(cc1)-n1nc(cc1NC(=O)Nc1ccc(cc1)-n1cnnn1)C(C)(C)C