Reaction Details
TargetCytochrome P450 2C8
LigandBDBM50440369
Substrate/Competitorn/a
Meas. Tech.ChEMBL_983550 (CHEMBL2429620)
IC50>10000±n/a nM
Citation Grädler, UBomke, JMusil, DDresing, VLehmann, MHölzemann, GGreiner, HEsdar, CKrier, MHeinrich, T Fragment-based discovery of focal adhesion kinase inhibitors. Bioorg Med Chem Lett23:5401-9 (2013) 
 
Cytochrome P450 2C8
Name:Cytochrome P450 2C8
Type:Protein
Mol. Mass.:55839.23
Organism:Homo sapiens (Human)
Description:P10632
Residue:490
BDBM50440369
NameBDBM50440369
Synonyms:CHEMBL2425145
TypeSmall organic molecule
Emp. Form.C25H28N6O
Mol. Mass.428.5294
SMILESCc1cn(cn1)-c1ccc(NC(=O)Nc2cc(nn2-c2ccc(C)cc2)C(C)(C)C)cc1