Reaction Details
TargetCytochrome P450 1A2
LigandBDBM50440361
Substrate/Competitorn/a
Meas. Tech.ChEMBL_983551 (CHEMBL2429621)
IC50>10000±n/a nM
Citation Grädler, UBomke, JMusil, DDresing, VLehmann, MHölzemann, GGreiner, HEsdar, CKrier, MHeinrich, T Fragment-based discovery of focal adhesion kinase inhibitors. Bioorg Med Chem Lett23:5401-9 (2013) 
 
Cytochrome P450 1A2
Name:Cytochrome P450 1A2
Type:Enzyme
Mol. Mass.:58423.38
Organism:Homo sapiens (Human)
Description:P05177
Residue:516
BDBM50440361
NameBDBM50440361
Synonyms:CHEMBL2425153
TypeSmall organic molecule
Emp. Form.C24H25N5O2
Mol. Mass.415.4876
SMILESCc1ccc(cc1)-n1nc(cc1NC(=O)Nc1ccc(cc1)-c1cnco1)C(C)(C)C