Reaction Details
TargetFocal adhesion kinase 1
LigandBDBM50440353
Substrate/Competitorn/a
Meas. Tech.ChEMBL_983671 (CHEMBL2427451)
Kd>25000±n/a nM
Citation Grädler, UBomke, JMusil, DDresing, VLehmann, MHölzemann, GGreiner, HEsdar, CKrier, MHeinrich, T Fragment-based discovery of focal adhesion kinase inhibitors. Bioorg Med Chem Lett23:5401-9 (2013) 
 
Focal adhesion kinase 1
Name:Focal adhesion kinase 1
Type:Tyrosine-protein kinase
Mol. Mass.:119233.17
Organism:Homo sapiens (Human)
Description:Q05397
Residue:1052
BDBM50440353
NameBDBM50440353
Synonyms:CHEMBL2425161
TypeSmall organic molecule
Emp. Form.C33H33N5O2
Mol. Mass.531.6474
SMILESCc1ccc(cc1)-n1nc(cc1NC(=O)Nc1ccc(cc1)-c1ccc(OCc2ccccc2)nc1)C(C)(C)C