Reaction Details
TargetFocal adhesion kinase 1
LigandBDBM50440365
Substrate/Competitorn/a
Meas. Tech.ChEMBL_983671 (CHEMBL2427451)
Kd 4590±n/a nM
Citation Grädler, UBomke, JMusil, DDresing, VLehmann, MHölzemann, GGreiner, HEsdar, CKrier, MHeinrich, T Fragment-based discovery of focal adhesion kinase inhibitors. Bioorg Med Chem Lett23:5401-9 (2013) 
 
Focal adhesion kinase 1
Name:Focal adhesion kinase 1
Type:Tyrosine-protein kinase
Mol. Mass.:119233.17
Organism:Homo sapiens (Human)
Description:Q05397
Residue:1052
BDBM50440365
NameBDBM50440365
Synonyms:CHEMBL2425149
TypeSmall organic molecule
Emp. Form.C24H24Cl2N6O
Mol. Mass.483.393
SMILESCc1ccc(cc1)-n1nc(cc1NC(=O)Nc1ccc(cc1)-n1cnc(Cl)c1Cl)C(C)(C)C