Reaction Details
TargetFocal adhesion kinase 1
LigandBDBM50440366
Substrate/Competitorn/a
Meas. Tech.ChEMBL_983671 (CHEMBL2427451)
Kd 4000±n/a nM
Citation Grädler, UBomke, JMusil, DDresing, VLehmann, MHölzemann, GGreiner, HEsdar, CKrier, MHeinrich, T Fragment-based discovery of focal adhesion kinase inhibitors. Bioorg Med Chem Lett23:5401-9 (2013) 
 
Focal adhesion kinase 1
Name:Focal adhesion kinase 1
Type:Tyrosine-protein kinase
Mol. Mass.:119233.17
Organism:Homo sapiens (Human)
Description:Q05397
Residue:1052
BDBM50440366
NameBDBM50440366
Synonyms:CHEMBL2425148
TypeSmall organic molecule
Emp. Form.C24H27N7OS
Mol. Mass.461.582
SMILESCc1ccc(cc1)-n1nc(cc1NC(=O)Nc1ccc(cc1)-c1n[nH]c(=S)n1C)C(C)(C)C