Reaction Details
TargetFocal adhesion kinase 1
LigandBDBM50440367
Substrate/Competitorn/a
Meas. Tech.ChEMBL_983671 (CHEMBL2427451)
Kd 3120±n/a nM
Citation Grädler, UBomke, JMusil, DDresing, VLehmann, MHölzemann, GGreiner, HEsdar, CKrier, MHeinrich, T Fragment-based discovery of focal adhesion kinase inhibitors. Bioorg Med Chem Lett23:5401-9 (2013) 
 
Focal adhesion kinase 1
Name:Focal adhesion kinase 1
Type:Tyrosine-protein kinase
Mol. Mass.:119233.17
Organism:Homo sapiens (Human)
Description:Q05397
Residue:1052
BDBM50440367
NameBDBM50440367
Synonyms:CHEMBL2425147
TypeSmall organic molecule
Emp. Form.C23H25N7O
Mol. Mass.415.4909
SMILESCc1ccc(cc1)-n1nc(cc1NC(=O)Nc1ccc(cc1)-n1cnnc1)C(C)(C)C