Reaction Details
TargetTelomerase reverse transcriptase
LigandBDBM50134018
Substrate/Competitorn/a
Meas. Tech.ChEMBL_980998 (CHEMBL2427719)
IC50 60±n/a nM
Citation Artese, ACosta, GDistinto, SMoraca, FOrtuso, FParrotta, LAlcaro, S Toward the design of new DNA G-quadruplex ligands through rational analysis of polymorphism and binding data. Eur J Med Chem68:139-49 (2013) 
 
Telomerase reverse transcriptase
Name:Telomerase reverse transcriptase
Type:PROTEIN
Mol. Mass.:127099.03
Organism:Homo sapiens (Human)
Description:ChEMBL_1447029
Residue:1132
BDBM50134018
NameBDBM50134018
Synonyms:CHEMBL335819 N-[9-(4-Amino-phenylamino)-6-(3-pyrrolidin-1-yl-propionylamino)-acridin-3-yl]-3-pyrrolidin-1-yl-propionamide
TypeSmall organic molecule
Emp. Form.C33H39N7O2
Mol. Mass.565.7085
SMILESNc1ccc(Nc2c3ccc(NC(=O)CCN4CCCC4)cc3nc3cc(NC(=O)CCN4CCCC4)ccc23)cc1