Reaction Details
TargetDual specificity protein kinase CLK3
LigandBDBM50440393
Substrate/Competitorn/a
Meas. Tech.ChEMBL_981760 (CHEMBL2426841)
IC50 150±n/a nM
Citation Yoshida, KItoyama, RYamahira, MTanaka, JLoaëc, NLozach, ODurieu, EFukuda, TIshibashi, FMeijer, LIwao, M Synthesis, resolution, and biological evaluation of atropisomeric (aR)- and (aS)-16-methyllamellarins N: unique effects of the axial chirality on the selectivity of protein kinases inhibition. J Med Chem56:7289-301 (2013) 
 
Dual specificity protein kinase CLK3
Name:Dual specificity protein kinase CLK3
Type:PROTEIN
Mol. Mass.:73855.32
Organism:Mus musculus
Description:ChEMBL_1502247
Residue:638
BDBM50440393
NameBDBM50440393
Synonyms:CHEMBL2425487
TypeSmall organic molecule
Emp. Form.C29H23NO8
Mol. Mass.513.4948
SMILESCOc1cc(C)c(cc1O)-c1c2c(n3ccc4cc(O)c(OC)cc4c13)c(=O)oc1cc(O)c(OC)cc21