Reaction Details
TargetTransient receptor potential cation channel subfamily V member 1
LigandBDBM50440402
Substrate/Competitorn/a
Meas. Tech.ChEMBL_982058 (CHEMBL2428533)
EC50 16±n/a nM
Citation Lim, KSLee, HKim, SEHa, THAnn, JSon, KChoi, SSun, WPearce, LVDeAndrea-Lazarus, IABlumberg, PMLee, J The carbonate analogues of 5'-halogenated resiniferatoxin as TRPV1 ligands. Eur J Med Chem68:233-43 (2013) 
 
Transient receptor potential cation channel subfamily V member 1
Name:Transient receptor potential cation channel subfamily V member 1
Type:Protein
Mol. Mass.:94960.75
Organism:Homo sapiens (Human)
Description:Q8NER1
Residue:839
BDBM50440402
NameBDBM50440402
Synonyms:CHEMBL2425547
TypeSmall organic molecule
Emp. Form.C36H37FO10
Mol. Mass.648.6714
SMILESCOc1cc(OC(=O)OCC2=C[C@H]3[C@H]4O[C@]5(Cc6ccccc6)O[C@]4(C[C@@H](C)[C@]3(O5)[C@@H]3C=C(C)C(=O)[C@@]3(O)C2)C(C)=C)cc(F)c1O