Reaction Details
TargetGlucocorticoid receptor
LigandBDBM50440484
Substrate/Competitorn/a
Meas. Tech.ChEMBL_983188 (CHEMBL2428100)
Ki 11.0±n/a nM
Citation Xiao, HYWu, DRSheppeck, JEHabte, SFCunningham, MDSomerville, JEBarrish, JCNadler, SGDhar, TG Heterocyclic glucocorticoid receptor modulators with a 2,2-dimethyl-3-phenyl-N-(thiazol or thiadiazol-2-yl)propanamide core. Bioorg Med Chem Lett23:5571-4 (2013) 
 
Glucocorticoid receptor
Name:Glucocorticoid receptor
Type:Enzyme
Mol. Mass.:85656.87
Organism:Homo sapiens (Human)
Description:P04150
Residue:777
BDBM50440484
NameBDBM50440484
Synonyms:CHEMBL2426139
TypeSmall organic molecule
Emp. Form.C27H24N4OS
Mol. Mass.452.571
SMILESCC(C)(C(c1ccccc1)c1ccn2c(ncc2c1)-c1ccccc1)C(=O)Nc1nccs1