Reaction Details
TargetGlucocorticoid receptor
LigandBDBM50440500
Substrate/Competitorn/a
Meas. Tech.ChEMBL_983185 (CHEMBL2428097)
EC50>10000±n/a nM
Citation Xiao, HYWu, DRSheppeck, JEHabte, SFCunningham, MDSomerville, JEBarrish, JCNadler, SGDhar, TG Heterocyclic glucocorticoid receptor modulators with a 2,2-dimethyl-3-phenyl-N-(thiazol or thiadiazol-2-yl)propanamide core. Bioorg Med Chem Lett23:5571-4 (2013) 
 
Glucocorticoid receptor
Name:Glucocorticoid receptor
Type:Enzyme
Mol. Mass.:85656.87
Organism:Homo sapiens (Human)
Description:P04150
Residue:777
BDBM50440500
NameBDBM50440500
Synonyms:CHEMBL2426141
TypeSmall organic molecule
Emp. Form.C28H23N5OS
Mol. Mass.477.58
SMILESCC(C)(C(c1ccccc1)c1ccc2c(ncn2c1)-c1cccc(c1)C#N)C(=O)Nc1nccs1