Reaction Details
TargetRecQ-like DNA helicase BLM
LigandBDBM50440538
Substrate/Competitorn/a
Meas. Tech.ChEMBL_983202 (CHEMBL2428261)
IC50 1100±n/a nM
Citation Rosenthal, ASDexheimer, TSGileadi, ONguyen, GHChu, WKHickson, IDJadhav, ASimeonov, AMaloney, DJ Synthesis and SAR studies of 5-(pyridin-4-yl)-1,3,4-thiadiazol-2-amine derivatives as potent inhibitors of Bloom helicase. Bioorg Med Chem Lett23:5660-6 (2013) 
 
RecQ-like DNA helicase BLM
Name:RecQ-like DNA helicase BLM
Type:PROTEIN
Mol. Mass.:159016.30
Organism:Homo sapiens (Human)
Description:ChEMBL_103670
Residue:1417
BDBM50440538
NameBDBM50440538
Synonyms:CHEMBL2426174
TypeSmall organic molecule
Emp. Form.C18H12N8OS
Mol. Mass.388.406
SMILESO=C(Nc1nnc(s1)-c1ccncc1)Nc1ccc(-c2cn[nH]c2)c(c1)C#N